Orbiter-Forum  

Go Back   Orbiter-Forum > Orbiter Addons > Addon Requests
Register Blogs Orbinauts List Social Groups FAQ Projects Mark Forums Read

Addon Requests If you have a request for a new addon or want to know where to find a specific addon, ask it here!

Reply
 
Thread Tools
Old 05-17-2018, 06:32 AM   #16
chevelle505
Orbinaut
Default

Ok tried that according to the instructions and I end up with ....

Code:
1>------ Build started: Project: libUltra, Configuration: Release Win32 ------
2>------ Build started: Project: Atlantis_Chute, Configuration: Release Win32 ------
3>------ Build started: Project: Atlantis_MLP, Configuration: Release Win32 ------
4>------ Build started: Project: Atlantis_SRB, Configuration: Release Win32 ------
1>C:\Program Files (x86)\Microsoft Visual Studio\2017\Community\Common7\IDE\VC\VCTargets\Platforms\Win32\PlatformToolsets\v141\Toolset.targets(34,5): error MSB8036: The Windows SDK version 10.0.15063.0 was not found. Install the required version of Windows SDK or change the SDK version in the project property pages or by right-clicking the solution and selecting "Retarget solution".
1>Done building project "libUltra_2017.vcxproj" -- FAILED.
5>------ Build started: Project: Atlantis, Configuration: Release Win32 ------
2>C:\Program Files (x86)\Microsoft Visual Studio\2017\Community\Common7\IDE\VC\VCTargets\Platforms\Win32\PlatformToolsets\v141\Toolset.targets(34,5): error MSB8036: The Windows SDK version 10.0.15063.0 was not found. Install the required version of Windows SDK or change the SDK version in the project property pages or by right-clicking the solution and selecting "Retarget solution".
2>Done building project "Atlantis_Chute_2017.vcxproj" -- FAILED.
6>------ Build started: Project: Atlantis_Tank, Configuration: Release Win32 ------
3>C:\Program Files (x86)\Microsoft Visual Studio\2017\Community\Common7\IDE\VC\VCTargets\Platforms\Win32\PlatformToolsets\v141\Toolset.targets(34,5): error MSB8036: The Windows SDK version 10.0.15063.0 was not found. Install the required version of Windows SDK or change the SDK version in the project property pages or by right-clicking the solution and selecting "Retarget solution".
3>Done building project "Atlantis_MLP_2017.vcxproj" -- FAILED.
7>------ Build started: Project: Crawler, Configuration: Release Win32 ------
5>C:\Program Files (x86)\Microsoft Visual Studio\2017\Community\Common7\IDE\VC\VCTargets\Platforms\Win32\PlatformToolsets\v141\Toolset.targets(34,5): error MSB8036: The Windows SDK version 10.0.15063.0 was not found. Install the required version of Windows SDK or change the SDK version in the project property pages or by right-clicking the solution and selecting "Retarget solution".
5>Done building project "Atlantis_2017.vcxproj" -- FAILED.
8>------ Build started: Project: SSU_LCC, Configuration: Release Win32 ------
8>C:\Program Files (x86)\Microsoft Visual Studio\2017\Community\Common7\IDE\VC\VCTargets\Platforms\Win32\PlatformToolsets\v141\Toolset.targets(34,5): error MSB8036: The Windows SDK version 10.0.15063.0 was not found. Install the required version of Windows SDK or change the SDK version in the project property pages or by right-clicking the solution and selecting "Retarget solution".
8>Done building project "SSU_LCC_2017.vcxproj" -- FAILED.
9>------ Build started: Project: SSU_Pad, Configuration: Release Win32 ------
6>C:\Program Files (x86)\Microsoft Visual Studio\2017\Community\Common7\IDE\VC\VCTargets\Platforms\Win32\PlatformToolsets\v141\Toolset.targets(34,5): error MSB8036: The Windows SDK version 10.0.15063.0 was not found. Install the required version of Windows SDK or change the SDK version in the project property pages or by right-clicking the solution and selecting "Retarget solution".
6>Done building project "Atlantis_Tank_2017.vcxproj" -- FAILED.
10>------ Build started: Project: Xenon_Lights, Configuration: Release Win32 ------
7>C:\Program Files (x86)\Microsoft Visual Studio\2017\Community\Common7\IDE\VC\VCTargets\Platforms\Win32\PlatformToolsets\v141\Toolset.targets(34,5): error MSB8036: The Windows SDK version 10.0.15063.0 was not found. Install the required version of Windows SDK or change the SDK version in the project property pages or by right-clicking the solution and selecting "Retarget solution".
7>Done building project "Crawler_2017.vcxproj" -- FAILED.
11>------ Build started: Project: SSU_Centaur, Configuration: Release Win32 ------
12>------ Build started: Project: SSU_IUS, Configuration: Release Win32 ------
4>C:\Program Files (x86)\Microsoft Visual Studio\2017\Community\Common7\IDE\VC\VCTargets\Platforms\Win32\PlatformToolsets\v141\Toolset.targets(34,5): error MSB8036: The Windows SDK version 10.0.15063.0 was not found. Install the required version of Windows SDK or change the SDK version in the project property pages or by right-clicking the solution and selecting "Retarget solution".
4>Done building project "Atlantis_SRB_2017.vcxproj" -- FAILED.
13>------ Build started: Project: SSU_SLC6, Configuration: Release Win32 ------
10>C:\Program Files (x86)\Microsoft Visual Studio\2017\Community\Common7\IDE\VC\VCTargets\Platforms\Win32\PlatformToolsets\v141\Toolset.targets(34,5): error MSB8036: The Windows SDK version 10.0.15063.0 was not found. Install the required version of Windows SDK or change the SDK version in the project property pages or by right-clicking the solution and selecting "Retarget solution".
10>Done building project "Xenon_Lights_2017.vcxproj" -- FAILED.
14>------ Build started: Project: ssumeshc, Configuration: Release Win32 ------
11>C:\Program Files (x86)\Microsoft Visual Studio\2017\Community\Common7\IDE\VC\VCTargets\Platforms\Win32\PlatformToolsets\v141\Toolset.targets(34,5): error MSB8036: The Windows SDK version 10.0.15063.0 was not found. Install the required version of Windows SDK or change the SDK version in the project property pages or by right-clicking the solution and selecting "Retarget solution".
11>Done building project "SSU_Centaur_2017.vcxproj" -- FAILED.
15>------ Build started: Project: VAB, Configuration: Release Win32 ------
12>C:\Program Files (x86)\Microsoft Visual Studio\2017\Community\Common7\IDE\VC\VCTargets\Platforms\Win32\PlatformToolsets\v141\Toolset.targets(34,5): error MSB8036: The Windows SDK version 10.0.15063.0 was not found. Install the required version of Windows SDK or change the SDK version in the project property pages or by right-clicking the solution and selecting "Retarget solution".
12>Done building project "SSU_IUS_2017.vcxproj" -- FAILED.
16>------ Skipped Build: Project: libUltraTests, Configuration: Release Win32 ------
16>Project not selected to build for this solution configuration 
14>C:\Program Files (x86)\Microsoft Visual Studio\2017\Community\Common7\IDE\VC\VCTargets\Platforms\Win32\PlatformToolsets\v141\Toolset.targets(34,5): error MSB8036: The Windows SDK version 10.0.15063.0 was not found. Install the required version of Windows SDK or change the SDK version in the project property pages or by right-clicking the solution and selecting "Retarget solution".
14>Done building project "ssumeshc_2017.vcxproj" -- FAILED.
15>C:\Program Files (x86)\Microsoft Visual Studio\2017\Community\Common7\IDE\VC\VCTargets\Platforms\Win32\PlatformToolsets\v141\Toolset.targets(34,5): error MSB8036: The Windows SDK version 10.0.15063.0 was not found. Install the required version of Windows SDK or change the SDK version in the project property pages or by right-clicking the solution and selecting "Retarget solution".
15>Done building project "VAB_2017.vcxproj" -- FAILED.
13>C:\Program Files (x86)\Microsoft Visual Studio\2017\Community\Common7\IDE\VC\VCTargets\Platforms\Win32\PlatformToolsets\v141\Toolset.targets(34,5): error MSB8036: The Windows SDK version 10.0.15063.0 was not found. Install the required version of Windows SDK or change the SDK version in the project property pages or by right-clicking the solution and selecting "Retarget solution".
13>Done building project "SSU_SLC6_2017.vcxproj" -- FAILED.
========== Build: 0 succeeded, 15 failed, 0 up-to-date, 1 skipped ==========

Followed everything to a T!! Any Ideas or am I stuck with 2010?

Last edited by IronRain; 05-17-2018 at 08:41 AM. Reason: Wrap the code in a [code] block
chevelle505 is offline   Reply With Quote
Old 05-17-2018, 08:42 AM   #17
IronRain
Moderator
 
IronRain's Avatar


Default

I took the liberty to wrap your output in a [code] block
IronRain is offline   Reply With Quote
Old 05-17-2018, 12:36 PM   #18
chevelle505
Orbinaut
Default

Thanks IronRain...alot easier to distinguish lol..ill be sure to do that next time
chevelle505 is offline   Reply With Quote
Old 05-17-2018, 12:38 PM   #19
GLS
Addon Developer
 
GLS's Avatar
Default

Quote:
Originally Posted by chevelle505 View Post
 Ok tried that according to the instructions and I end up with ....

Code:
1>------ Build started: Project: libUltra, Configuration: Release Win32 ------
2>------ Build started: Project: Atlantis_Chute, Configuration: Release Win32 ------
3>------ Build started: Project: Atlantis_MLP, Configuration: Release Win32 ------
4>------ Build started: Project: Atlantis_SRB, Configuration: Release Win32 ------
1>C:\Program Files (x86)\Microsoft Visual Studio\2017\Community\Common7\IDE\VC\VCTargets\Platforms\Win32\PlatformToolsets\v141\Toolset.targets(34,5): error MSB8036: The Windows SDK version 10.0.15063.0 was not found. Install the required version of Windows SDK or change the SDK version in the project property pages or by right-clicking the solution and selecting "Retarget solution".
1>Done building project "libUltra_2017.vcxproj" -- FAILED.
5>------ Build started: Project: Atlantis, Configuration: Release Win32 ------
2>C:\Program Files (x86)\Microsoft Visual Studio\2017\Community\Common7\IDE\VC\VCTargets\Platforms\Win32\PlatformToolsets\v141\Toolset.targets(34,5): error MSB8036: The Windows SDK version 10.0.15063.0 was not found. Install the required version of Windows SDK or change the SDK version in the project property pages or by right-clicking the solution and selecting "Retarget solution".
2>Done building project "Atlantis_Chute_2017.vcxproj" -- FAILED.
6>------ Build started: Project: Atlantis_Tank, Configuration: Release Win32 ------
3>C:\Program Files (x86)\Microsoft Visual Studio\2017\Community\Common7\IDE\VC\VCTargets\Platforms\Win32\PlatformToolsets\v141\Toolset.targets(34,5): error MSB8036: The Windows SDK version 10.0.15063.0 was not found. Install the required version of Windows SDK or change the SDK version in the project property pages or by right-clicking the solution and selecting "Retarget solution".
3>Done building project "Atlantis_MLP_2017.vcxproj" -- FAILED.
7>------ Build started: Project: Crawler, Configuration: Release Win32 ------
5>C:\Program Files (x86)\Microsoft Visual Studio\2017\Community\Common7\IDE\VC\VCTargets\Platforms\Win32\PlatformToolsets\v141\Toolset.targets(34,5): error MSB8036: The Windows SDK version 10.0.15063.0 was not found. Install the required version of Windows SDK or change the SDK version in the project property pages or by right-clicking the solution and selecting "Retarget solution".
5>Done building project "Atlantis_2017.vcxproj" -- FAILED.
8>------ Build started: Project: SSU_LCC, Configuration: Release Win32 ------
8>C:\Program Files (x86)\Microsoft Visual Studio\2017\Community\Common7\IDE\VC\VCTargets\Platforms\Win32\PlatformToolsets\v141\Toolset.targets(34,5): error MSB8036: The Windows SDK version 10.0.15063.0 was not found. Install the required version of Windows SDK or change the SDK version in the project property pages or by right-clicking the solution and selecting "Retarget solution".
8>Done building project "SSU_LCC_2017.vcxproj" -- FAILED.
9>------ Build started: Project: SSU_Pad, Configuration: Release Win32 ------
6>C:\Program Files (x86)\Microsoft Visual Studio\2017\Community\Common7\IDE\VC\VCTargets\Platforms\Win32\PlatformToolsets\v141\Toolset.targets(34,5): error MSB8036: The Windows SDK version 10.0.15063.0 was not found. Install the required version of Windows SDK or change the SDK version in the project property pages or by right-clicking the solution and selecting "Retarget solution".
6>Done building project "Atlantis_Tank_2017.vcxproj" -- FAILED.
10>------ Build started: Project: Xenon_Lights, Configuration: Release Win32 ------
7>C:\Program Files (x86)\Microsoft Visual Studio\2017\Community\Common7\IDE\VC\VCTargets\Platforms\Win32\PlatformToolsets\v141\Toolset.targets(34,5): error MSB8036: The Windows SDK version 10.0.15063.0 was not found. Install the required version of Windows SDK or change the SDK version in the project property pages or by right-clicking the solution and selecting "Retarget solution".
7>Done building project "Crawler_2017.vcxproj" -- FAILED.
11>------ Build started: Project: SSU_Centaur, Configuration: Release Win32 ------
12>------ Build started: Project: SSU_IUS, Configuration: Release Win32 ------
4>C:\Program Files (x86)\Microsoft Visual Studio\2017\Community\Common7\IDE\VC\VCTargets\Platforms\Win32\PlatformToolsets\v141\Toolset.targets(34,5): error MSB8036: The Windows SDK version 10.0.15063.0 was not found. Install the required version of Windows SDK or change the SDK version in the project property pages or by right-clicking the solution and selecting "Retarget solution".
4>Done building project "Atlantis_SRB_2017.vcxproj" -- FAILED.
13>------ Build started: Project: SSU_SLC6, Configuration: Release Win32 ------
10>C:\Program Files (x86)\Microsoft Visual Studio\2017\Community\Common7\IDE\VC\VCTargets\Platforms\Win32\PlatformToolsets\v141\Toolset.targets(34,5): error MSB8036: The Windows SDK version 10.0.15063.0 was not found. Install the required version of Windows SDK or change the SDK version in the project property pages or by right-clicking the solution and selecting "Retarget solution".
10>Done building project "Xenon_Lights_2017.vcxproj" -- FAILED.
14>------ Build started: Project: ssumeshc, Configuration: Release Win32 ------
11>C:\Program Files (x86)\Microsoft Visual Studio\2017\Community\Common7\IDE\VC\VCTargets\Platforms\Win32\PlatformToolsets\v141\Toolset.targets(34,5): error MSB8036: The Windows SDK version 10.0.15063.0 was not found. Install the required version of Windows SDK or change the SDK version in the project property pages or by right-clicking the solution and selecting "Retarget solution".
11>Done building project "SSU_Centaur_2017.vcxproj" -- FAILED.
15>------ Build started: Project: VAB, Configuration: Release Win32 ------
12>C:\Program Files (x86)\Microsoft Visual Studio\2017\Community\Common7\IDE\VC\VCTargets\Platforms\Win32\PlatformToolsets\v141\Toolset.targets(34,5): error MSB8036: The Windows SDK version 10.0.15063.0 was not found. Install the required version of Windows SDK or change the SDK version in the project property pages or by right-clicking the solution and selecting "Retarget solution".
12>Done building project "SSU_IUS_2017.vcxproj" -- FAILED.
16>------ Skipped Build: Project: libUltraTests, Configuration: Release Win32 ------
16>Project not selected to build for this solution configuration 
14>C:\Program Files (x86)\Microsoft Visual Studio\2017\Community\Common7\IDE\VC\VCTargets\Platforms\Win32\PlatformToolsets\v141\Toolset.targets(34,5): error MSB8036: The Windows SDK version 10.0.15063.0 was not found. Install the required version of Windows SDK or change the SDK version in the project property pages or by right-clicking the solution and selecting "Retarget solution".
14>Done building project "ssumeshc_2017.vcxproj" -- FAILED.
15>C:\Program Files (x86)\Microsoft Visual Studio\2017\Community\Common7\IDE\VC\VCTargets\Platforms\Win32\PlatformToolsets\v141\Toolset.targets(34,5): error MSB8036: The Windows SDK version 10.0.15063.0 was not found. Install the required version of Windows SDK or change the SDK version in the project property pages or by right-clicking the solution and selecting "Retarget solution".
15>Done building project "VAB_2017.vcxproj" -- FAILED.
13>C:\Program Files (x86)\Microsoft Visual Studio\2017\Community\Common7\IDE\VC\VCTargets\Platforms\Win32\PlatformToolsets\v141\Toolset.targets(34,5): error MSB8036: The Windows SDK version 10.0.15063.0 was not found. Install the required version of Windows SDK or change the SDK version in the project property pages or by right-clicking the solution and selecting "Retarget solution".
13>Done building project "SSU_SLC6_2017.vcxproj" -- FAILED.
========== Build: 0 succeeded, 15 failed, 0 up-to-date, 1 skipped ==========

Followed everything to a T!! Any Ideas or am I stuck with 2010?
When installing VS2017 you need to make sure you select "Windows SDK version 10.0.15063.0" in the options. If you re-run the installer you can select the correct version.
GLS is online now   Reply With Quote
Old 05-17-2018, 09:22 PM   #20
DaveS
Addon Developer
 
DaveS's Avatar


Default

Quote:
Originally Posted by chevelle505 View Post
 How in the world do i perform these procedures guys? Id love to learn what everthing does in the SSU but it seems its up to you to take what knowledge you have of orbiter in general and just start clicking this to see what happens...no detailed documentation on this??
There is, it's called reading the actual historic documentation of the shuttle. The best start is the the Shuttle Crew Operations Manual (SCOM) available for download here: https://www.nasa.gov/centers/johnson...ons_manual.pdf

Actual historic checklists (in NASA Shuttle parlance, Flight Data File, FDF) are available here: https://www.nasa.gov/centers/johnson...les/index.html

I would also recommend reading through the available workbooks, which are available at the same link.

The objective of SSU is to be as close to the real shuttle hardware as possible.
DaveS is offline   Reply With Quote
Old 05-18-2018, 01:02 AM   #21
Shifty
Orbinaut
Default

Quote:
Originally Posted by chevelle505 View Post
 also as for the Apollo AMSO, I cannot seem to find the manual in english, it mentions an english version but no link...the link there is in french..any ideas? thanks again guys.
The english version of the manual is here:
http://www.acsoft.ch/AMSO/AMSO-User-manual.doc

I put together a kind of step-by-step guide a few years ago that explains how to run through Apollo 11. You may find it helpful:
https://www.orbiter-forum.com/showthread.php?t=34350
Shifty is offline   Reply With Quote
Reply

  Orbiter-Forum > Orbiter Addons > Addon Requests


Thread Tools

Posting Rules
BB code is On
Smilies are On
[IMG] code is On
HTML code is Off
You may not post new threads
You may not post replies
You may not post attachments
You may not edit your posts
Forum Jump


All times are GMT. The time now is 06:45 PM.

Quick Links Need Help?


About Us | Rules & Guidelines | TOS Policy | Privacy Policy

Orbiter-Forum is hosted at Orbithangar.com
Powered by vBulletin® Version 3.8.6
Copyright ©2000 - 2018, Jelsoft Enterprises Ltd.
Copyright 2007 - 2017, Orbiter-Forum.com. All rights reserved.